Reaction Details
TargetFlap endonuclease 1
LigandBDBM50157854
Substrate/Competitorn/a
Meas. Tech.ChEMBL_304960 (CHEMBL827838)
IC50 0.009±n/a nM
Citation Tumey, LNBom, DHuck, BGleason, EWang, JSilver, DBrunden, KBoozer, SRundlett, SSherf, BMurphy, SDent, TLeventhal, CBailey, AHarrington, JBennani, YL The identification and optimization of a N-hydroxy urea series of flap endonuclease 1 inhibitors. Bioorg Med Chem Lett15:277-81 (2004) 
 
Flap endonuclease 1
Name:Flap endonuclease 1
Type:PROTEIN
Mol. Mass.:42602.57
Organism:Homo sapiens (Human)
Description:ChEMBL_1517026
Residue:380
BDBM50157854
NameBDBM50157854
Synonyms:5,6-Dibutyl-3-hydroxy-1H-thieno[2,3-d]pyrimidine-2,4-dione | CHEMBL362842
TypeSmall organic molecule
Emp. Form.C10H10N2O3S
Mol. Mass.238.263
SMILESOn1c(=O)[nH]c2sc3CCCCc3c2c1=O