Reaction Details
TargetAcetylcholinesterase
LigandBDBM50157911
Substrate/Competitorn/a
Meas. Tech.ChEMBL_305184 (CHEMBL832772)
IC50 2500±n/a nM
Citation Yoo, IDCho, KMLee, CKKim, WG Isoterreulactone A, a novel meroterpenoid with anti-acetylcholinesterase activity produced by Aspergillus terreus. Bioorg Med Chem Lett15:353-6 (2004) 
 
Acetylcholinesterase
Name:Acetylcholinesterase
Type:Enzyme
Mol. Mass.:67792.70
Organism:Homo sapiens (Human)
Description:P22303
Residue:614
BDBM50157911
NameBDBM50157911
Synonyms:13a-hydroxy-10-(4-methoxyphenyl)-5,5,5a,7a,13b-pentamethyl-1,2,3,5a,6,7,7a,13,13a,13b-decahydro-5H,12H-oxepino[4,3-f]pyrano[4,3-b]chromene-3,12-dione | CHEMBL359719
TypeSmall organic molecule
Emp. Form.C27H32O8
Mol. Mass.484.5382
SMILESCOc1ccc(cc1)-c1cc2O[C@]3(C)CC[C@@]4(O)[C@](C)(CCC(=O)OC4(C)C)[C@]3(O)Cc2c(=O)o1