Reaction Details
TargetPeroxisome proliferator-activated receptor gamma
LigandBDBM50157926
Substrate/Competitorn/a
Meas. Tech.ChEMBL_305707 (CHEMBL827222)
IC50 1±n/a nM
Citation Acton, JJBlack, RMJones, ABMoller, DEColwell, LDoebber, TWMacnaul, KLBerger, JWood, HB Benzoyl 2-methyl indoles as selective PPARgamma modulators. Bioorg Med Chem Lett15:357-62 (2004) 
 
Peroxisome proliferator-activated receptor gamma
Name:Peroxisome proliferator-activated receptor gamma
Type:Nuclear Receptor
Mol. Mass.:57613.46
Organism:Homo sapiens (Human)
Description:P37231
Residue:505
BDBM50157926
NameBDBM50157926
Synonyms:2-{3-[1-(4-Methoxy-benzoyl)-2-methyl-5-trifluoromethoxy-1H-indol-3-ylmethyl]-phenoxy}-propionic acid | CHEMBL435517
TypeSmall organic molecule
Emp. Form.C28H24F3NO6
Mol. Mass.527.4885
SMILESCOc1ccc(cc1)C(=O)n1c(C)c(Cc2cccc(OC(C)C(O)=O)c2)c2cc(OC(F)(F)F)ccc12