Reaction Details
Target5-hydroxytryptamine receptor 6
LigandBDBM50158030
Substrate/Competitorn/a
Meas. Tech.ChEMBL_303182 (CHEMBL829676)
Ki 3±n/a nM
Citation Cole, DCEllingboe, JWLennox, WJMazandarani, HSmith, DLStock, JRZhang, GZhou, PSchechter, LE N1-arylsulfonyl-3-(1,2,3,6-tetrahydropyridin-4-yl)-1H-indole derivatives are potent and selective 5-HT6 receptor antagonists. Bioorg Med Chem Lett15:379-83 (2004) 
 
5-hydroxytryptamine receptor 6
Name:5-hydroxytryptamine receptor 6
Type:G Protein-Coupled Receptor (GPCR)
Mol. Mass.:46968.43
Organism:Homo sapiens (Human)
Description:P50406
Residue:440
BDBM50158030
NameBDBM50158030
Synonyms:4-[6-Chloro-3-(1,2,3,6-tetrahydro-pyridin-4-yl)-indole-1-sulfonyl]-phenylamine | CHEMBL360234
TypeSmall organic molecule
Emp. Form.C19H18ClN3O2S
Mol. Mass.387.883
SMILESNc1ccc(cc1)S(=O)(=O)n1cc(C2=CCNCC2)c2ccc(Cl)cc12