Reaction Details
Target5-hydroxytryptamine receptor 2A
LigandBDBM50158032
Substrate/Competitorn/a
Meas. Tech.ChEMBL_303337 (CHEMBL840153)
Ki 599±n/a nM
Citation Cole, DCEllingboe, JWLennox, WJMazandarani, HSmith, DLStock, JRZhang, GZhou, PSchechter, LE N1-arylsulfonyl-3-(1,2,3,6-tetrahydropyridin-4-yl)-1H-indole derivatives are potent and selective 5-HT6 receptor antagonists. Bioorg Med Chem Lett15:379-83 (2004) 
 
5-hydroxytryptamine receptor 2A
Name:5-hydroxytryptamine receptor 2A
Type:undefined
Mol. Mass.:52607.65
Organism:Homo sapiens (Human)
Description:P28223
Residue:471
BDBM50158032
NameBDBM50158032
Synonyms:1-(2-Chloro-benzenesulfonyl)-3-(1,2,3,6-tetrahydro-pyridin-4-yl)-1H-indole | CHEMBL362487
TypeSmall organic molecule
Emp. Form.C19H17ClN2O2S
Mol. Mass.372.868
SMILESClc1ccccc1S(=O)(=O)n1cc(C2=CCNCC2)c2ccccc12