Reaction Details
Target5-hydroxytryptamine receptor 6
LigandBDBM50158038
Substrate/Competitorn/a
Meas. Tech.ChEMBL_303182 (CHEMBL829676)
Ki 2.4±n/a nM
Citation Cole, DCEllingboe, JWLennox, WJMazandarani, HSmith, DLStock, JRZhang, GZhou, PSchechter, LE N1-arylsulfonyl-3-(1,2,3,6-tetrahydropyridin-4-yl)-1H-indole derivatives are potent and selective 5-HT6 receptor antagonists. Bioorg Med Chem Lett15:379-83 (2004) 
 
5-hydroxytryptamine receptor 6
Name:5-hydroxytryptamine receptor 6
Type:G Protein-Coupled Receptor (GPCR)
Mol. Mass.:46968.43
Organism:Homo sapiens (Human)
Description:P50406
Residue:440
BDBM50158038
NameBDBM50158038
Synonyms:1-Benzenesulfonyl-5-fluoro-3-(1,2,3,6-tetrahydro-pyridin-4-yl)-1H-indole | CHEMBL361189
TypeSmall organic molecule
Emp. Form.C19H17FN2O2S
Mol. Mass.356.414
SMILESFc1ccc2n(cc(C3=CCNCC3)c2c1)S(=O)(=O)c1ccccc1