Reaction Details
Target5-hydroxytryptamine receptor 6
LigandBDBM50158042
Substrate/Competitorn/a
Meas. Tech.ChEMBL_312778 (CHEMBL833427)
IC50 14.1±n/a nM
Citation Cole, DCEllingboe, JWLennox, WJMazandarani, HSmith, DLStock, JRZhang, GZhou, PSchechter, LE N1-arylsulfonyl-3-(1,2,3,6-tetrahydropyridin-4-yl)-1H-indole derivatives are potent and selective 5-HT6 receptor antagonists. Bioorg Med Chem Lett15:379-83 (2004) 
 
5-hydroxytryptamine receptor 6
Name:5-hydroxytryptamine receptor 6
Type:G Protein-Coupled Receptor (GPCR)
Mol. Mass.:46968.43
Organism:Homo sapiens (Human)
Description:P50406
Residue:440
BDBM50158042
NameBDBM50158042
Synonyms:1-(5-Chloro-thiophene-2-sulfonyl)-3-(1,2,3,6-tetrahydro-pyridin-4-yl)-1H-indole | CHEMBL178234
TypeSmall organic molecule
Emp. Form.C17H15ClN2O2S2
Mol. Mass.378.896
SMILESClc1ccc(s1)S(=O)(=O)n1cc(C2=CCNCC2)c2ccccc12