Reaction Details
TargetD(4) dopamine receptor
LigandBDBM50158032
Substrate/Competitorn/a
Meas. Tech.ChEMBL_303265 (CHEMBL828259)
Ki>5000±n/a nM
Citation Cole, DCEllingboe, JWLennox, WJMazandarani, HSmith, DLStock, JRZhang, GZhou, PSchechter, LE N1-arylsulfonyl-3-(1,2,3,6-tetrahydropyridin-4-yl)-1H-indole derivatives are potent and selective 5-HT6 receptor antagonists. Bioorg Med Chem Lett15:379-83 (2004) 
 
D(4) dopamine receptor
Name:D(4) dopamine receptor
Type:Enzyme
Mol. Mass.:48373.19
Organism:Homo sapiens (Human)
Description:P21917
Residue:419
BDBM50158032
NameBDBM50158032
Synonyms:1-(2-Chloro-benzenesulfonyl)-3-(1,2,3,6-tetrahydro-pyridin-4-yl)-1H-indole | CHEMBL362487
TypeSmall organic molecule
Emp. Form.C19H17ClN2O2S
Mol. Mass.372.868
SMILESClc1ccccc1S(=O)(=O)n1cc(C2=CCNCC2)c2ccccc12