Reaction Details
TargetPotassium voltage-gated channel subfamily A member 3
LigandBDBM50158223
Substrate/Competitorn/a
Meas. Tech.ChEMBL_312673 (CHEMBL834820)
IC50 31±n/a nM
Citation Bao, JMiao, SKayser, FKotliar, AJBaker, RKDoss, GAFelix, JPBugianesi, RMSlaughter, RSKaczorowski, GJGarcia, MLHa, SNCastonguay, LKoo, GCShah, KSpringer, MSStaruch, MJParsons, WHRupprecht, KM Potent Kv1.3 inhibitors from correolide-modification of the C18 position. Bioorg Med Chem Lett15:447-51 (2004) 
 
Potassium voltage-gated channel subfamily A member 3
Name:Potassium voltage-gated channel subfamily A member 3
Type:PROTEIN
Mol. Mass.:63835.47
Organism:Homo sapiens (Human)
Description:ChEMBL_1513935
Residue:575
BDBM50158223
NameBDBM50158223
Synonyms:Aceticacid(R)-1-{(4R,4aR,5S,6R,6aR,11bS)-4,5,6-triacetoxy--hydroxy-1-[2-(2-isopropenyloxy-phenyl)-ethyl]-2,4a,11b-triethyl-1,2,3,4,4a,4b,5,6,9,11a,11b,12,13,13a-tetradecahydro-8-oxa-cyclohepta[a]phenanthren-6a-yl}-ethyl ester | CHEMBL425156
TypeSmall organic molecule
Emp. Form.C41H54O12
Mol. Mass.738.8603
SMILESC[C@@H](OC(C)=O)[C@]12COCC=CC1[C@]1(C)CCC3C(O)(CCc4ccccc4OC(C)=O)C(C)=C[C@@H](OC(C)=O)[C@]3(C)C1[C@H](OC(C)=O)[C@@H]2OC(C)=O