Reaction Details
TargetPotassium voltage-gated channel subfamily A member 3
LigandBDBM50158210
Substrate/Competitorn/a
Meas. Tech.ChEMBL_312673 (CHEMBL834820)
IC50 19±n/a nM
Citation Bao, JMiao, SKayser, FKotliar, AJBaker, RKDoss, GAFelix, JPBugianesi, RMSlaughter, RSKaczorowski, GJGarcia, MLHa, SNCastonguay, LKoo, GCShah, KSpringer, MSStaruch, MJParsons, WHRupprecht, KM Potent Kv1.3 inhibitors from correolide-modification of the C18 position. Bioorg Med Chem Lett15:447-51 (2004) 
 
Potassium voltage-gated channel subfamily A member 3
Name:Potassium voltage-gated channel subfamily A member 3
Type:PROTEIN
Mol. Mass.:63835.47
Organism:Homo sapiens (Human)
Description:ChEMBL_1513935
Residue:575
BDBM50158210
NameBDBM50158210
Synonyms:Aceticacid(R)-1-{(4R,4aR,5S,6R,6aR,11bS)-4,5,6-triacetoxy-1-hydroxy-1-[2-((R)-2-methoxy-phenyl)-propyl]-2,4a,11b-triethyl-1,2,3,4,4a,4b,5,6,9,11a,11b,12,13,13a-tetradecahydro-8-oxa-cyclohepta[a]phenanthren-6a-yl}-ethyl ester | CHEMBL176278
TypeSmall organic molecule
Emp. Form.C41H56O11
Mol. Mass.724.8767
SMILESCOc1ccccc1[C@H](C)C[C@@]1(O)C2CC[C@@]3(C)C4C=CCOC[C@]4([C@@H](C)OC(C)=O)[C@@H](OC(C)=O)[C@@H](OC(C)=O)C3[C@@]2(C)[C@H](OC(C)=O)C=C1C