Reaction Details
TargetGlycogen phosphorylase, liver form
LigandBDBM50158243
Substrate/Competitorn/a
Meas. Tech.ChEMBL_304931 (CHEMBL826961)
IC50 350±n/a nM
Citation Wright, SWRath, VLGenereux, PEHageman, DLLevy, CBMcClure, LDMcCoid, SCMcPherson, RKSchelhorn, TMWilder, DEZavadoski, WJGibbs, EMTreadway, JL 5-Chloroindoloyl glycine amide inhibitors of glycogen phosphorylase: synthesis, in vitro, in vivo, and X-ray crystallographic characterization. Bioorg Med Chem Lett15:459-65 (2004) 
 
Glycogen phosphorylase, liver form
Name:Glycogen phosphorylase, liver form
Type:Homodimer
Mol. Mass.:97153.98
Organism:Homo sapiens (Human)
Description:Dimers associate into a tetramer to form the enzymatically active phosphorylase A.
Residue:847
BDBM50158243
NameBDBM50158243
Synonyms:5-Chloro-1H-indole-2-carboxylic acid {[cyclopentyl-(2-hydroxy-1-hydroxymethyl-ethyl)-carbamoyl]-methyl}-amide | CHEMBL179609
TypeSmall organic molecule
Emp. Form.C19H24ClN3O4
Mol. Mass.393.865
SMILESOCC(CO)N(C1CCCC1)C(=O)CNC(=O)c1cc2cc(Cl)ccc2[nH]1