Reaction Details
TargetSphingosine 1-phosphate receptor 1
LigandBDBM50158341
Substrate/Competitorn/a
Meas. Tech.ChEMBL_430293 (CHEMBL913919)
IC50 3.2±n/a nM
Citation Hale, JJLynch, CLNeway, WMills, SGHajdu, RKeohane, CARosenbach, MJMilligan, JAShei, GJParent, SAChrebet, GBergstrom, JCard, DFerrer, MHodder, PStrulovici, BRosen, HMandala, S A rational utilization of high-throughput screening affords selective, orally bioavailable 1-benzyl-3-carboxyazetidine sphingosine-1-phosphate-1 receptor agonists. J Med Chem47:6662-5 (2004) 
 
Sphingosine 1-phosphate receptor 1
Name:Sphingosine 1-phosphate receptor 1
Type:Enzyme
Mol. Mass.:42836.02
Organism:Homo sapiens (Human)
Description:P21453
Residue:382
BDBM50158341
NameBDBM50158341
Synonyms:1-(3-chloro-4-((4-phenyl-5-(trifluoromethyl)thiophen-2-yl)methoxy)benzyl)azetidine-3-carboxylic acid | CHEMBL224571
TypeSmall organic molecule
Emp. Form.C23H19ClF3NO3S
Mol. Mass.481.915
SMILESOC(=O)C1CN(Cc2ccc(OCc3cc(c(s3)C(F)(F)F)-c3ccccc3)c(Cl)c2)C1