Reaction Details
TargetSphingosine 1-phosphate receptor 5
LigandBDBM50158345
Substrate/Competitorn/a
Meas. Tech.ChEMBL_430297 (CHEMBL913923)
IC50 4600±n/a nM
Citation Hale, JJLynch, CLNeway, WMills, SGHajdu, RKeohane, CARosenbach, MJMilligan, JAShei, GJParent, SAChrebet, GBergstrom, JCard, DFerrer, MHodder, PStrulovici, BRosen, HMandala, S A rational utilization of high-throughput screening affords selective, orally bioavailable 1-benzyl-3-carboxyazetidine sphingosine-1-phosphate-1 receptor agonists. J Med Chem47:6662-5 (2004) 
 
Sphingosine 1-phosphate receptor 5
Name:Sphingosine 1-phosphate receptor 5
Type:G Protein-Coupled Receptor (GPCR)
Mol. Mass.:41796.42
Organism:Homo sapiens (Human)
Description:n/a
Residue:398
BDBM50158345
NameBDBM50158345
Synonyms:5-(4-phenyl-5-(trifluoromethyl)thiophen-2-yl)-3-(3-(trifluoromethyl)phenyl)-1,2,4-oxadiazole | CHEMBL224720
TypeSmall organic molecule
Emp. Form.C20H10F6N2OS
Mol. Mass.440.362
SMILESFC(F)(F)c1sc(cc1-c1ccccc1)-c1nc(no1)-c1cccc(c1)C(F)(F)F