Reaction Details
TargetSphingosine 1-phosphate receptor 5
LigandBDBM50158335
Substrate/Competitorn/a
Meas. Tech.ChEMBL_430297 (CHEMBL913923)
IC50 23±n/a nM
Citation Hale, JJLynch, CLNeway, WMills, SGHajdu, RKeohane, CARosenbach, MJMilligan, JAShei, GJParent, SAChrebet, GBergstrom, JCard, DFerrer, MHodder, PStrulovici, BRosen, HMandala, S A rational utilization of high-throughput screening affords selective, orally bioavailable 1-benzyl-3-carboxyazetidine sphingosine-1-phosphate-1 receptor agonists. J Med Chem47:6662-5 (2004) 
 
Sphingosine 1-phosphate receptor 5
Name:Sphingosine 1-phosphate receptor 5
Type:G Protein-Coupled Receptor (GPCR)
Mol. Mass.:41796.42
Organism:Homo sapiens (Human)
Description:n/a
Residue:398
BDBM50158335
NameBDBM50158335
Synonyms:1-(4-((4-phenyl-5-(trifluoromethyl)thiophen-2-yl)methoxy)benzyl)azetidine-3-carboxylic acid CHEMBL425563
TypeSmall organic molecule
Emp. Form.C23H20F3NO3S
Mol. Mass.447.47
SMILESOC(=O)C1CN(Cc2ccc(OCc3cc(c(s3)C(F)(F)F)-c3ccccc3)cc2)C1