Reaction Details
TargetSphingosine 1-phosphate receptor 1
LigandBDBM50152329
Substrate/Competitorn/a
Meas. Tech.ChEMBL_430293 (CHEMBL913919)
IC50 6.9±n/a nM
Citation Hale, JJLynch, CLNeway, WMills, SGHajdu, RKeohane, CARosenbach, MJMilligan, JAShei, GJParent, SAChrebet, GBergstrom, JCard, DFerrer, MHodder, PStrulovici, BRosen, HMandala, S A rational utilization of high-throughput screening affords selective, orally bioavailable 1-benzyl-3-carboxyazetidine sphingosine-1-phosphate-1 receptor agonists. J Med Chem47:6662-5 (2004) 
 
Sphingosine 1-phosphate receptor 1
Name:Sphingosine 1-phosphate receptor 1
Type:Enzyme
Mol. Mass.:42836.02
Organism:Homo sapiens (Human)
Description:P21453
Residue:382
BDBM50152329
NameBDBM50152329
Synonyms:1-(4-nonylbenzyl)pyrrolidin-3-ylphosphonic acid [1-(4-Nonyl-benzyl)-pyrrolidin-3-yl]-phosphonic acid
TypeSmall organic molecule
Emp. Form.C20H34NO3P
Mol. Mass.367.4626
SMILESCCCCCCCCCc1ccc(CN2CCC(C2)P(O)(O)=O)cc1