Reaction Details
TargetSphingosine 1-phosphate receptor 3
LigandBDBM50158342
Substrate/Competitorn/a
Meas. Tech.ChEMBL_430295 (CHEMBL913921)
IC50 4900±n/a nM
Citation Hale, JJLynch, CLNeway, WMills, SGHajdu, RKeohane, CARosenbach, MJMilligan, JAShei, GJParent, SAChrebet, GBergstrom, JCard, DFerrer, MHodder, PStrulovici, BRosen, HMandala, S A rational utilization of high-throughput screening affords selective, orally bioavailable 1-benzyl-3-carboxyazetidine sphingosine-1-phosphate-1 receptor agonists. J Med Chem47:6662-5 (2004) 
 
Sphingosine 1-phosphate receptor 3
Name:Sphingosine 1-phosphate receptor 3
Type:G Protein-Coupled Receptor (GPCR)
Mol. Mass.:42278.13
Organism:Homo sapiens (Human)
Description:Q99500
Residue:378
BDBM50158342
NameBDBM50158342
Synonyms:1-(4-nonylbenzyl)azetidine-3-carboxylic acid | CHEMBL224623
TypeSmall organic molecule
Emp. Form.C20H31NO2
Mol. Mass.317.4656
SMILESCCCCCCCCCc1ccc(CN2CC(C2)C(O)=O)cc1