Reaction Details
TargetRetinoic acid receptor alpha
LigandBDBM50091698
Substrate/Competitorn/a
Meas. Tech.ChEMBL_430404 (CHEMBL916388)
IC50 20000±n/a nM
Citation Patel, JBHuynh, CKHandratta, VDGediya, LKBrodie, AMGoloubeva, OGClement, OONanne, IPSoprano, DRNjar, VC Novel retinoic acid metabolism blocking agents endowed with multiple biological activities are efficient growth inhibitors of human breast and prostate cancer cells in vitro and a human breast tumor xenograft in nude mice. J Med Chem47:6716-29 (2004) 
 
Retinoic acid receptor alpha
Name:Retinoic acid receptor alpha
Type:PROTEIN
Mol. Mass.:50778.87
Organism:Homo sapiens (Human)
Description:ChEMBL_1466191
Residue:462
BDBM50091698
NameBDBM50091698
Synonyms:(2E,4E,6E,8E)-9-(3-Imidazol-1-yl-2,6,6-trimethyl-cyclohex-1-enyl)-3,7-dimethyl-nona-2,4,6,8-tetraenoic acid CHEMBL57765
TypeSmall organic molecule
Emp. Form.C23H30N2O2
Mol. Mass.366.4965
SMILESC\C(\C=C\C1=C(C)C(CCC1(C)C)n1ccnc1)=C/C=C/C(/C)=C/C(O)=O