Reaction Details
TargetProstaglandin G/H synthase 2
LigandBDBM50056999
Substrate/Competitorn/a
Meas. Tech.ChEMBL_430458 (CHEMBL916302)
IC50 700±n/a nM
Citation Julémont, Fde Leval, XMichaux, CRenard, JFWinum, JYMontero, JLDamas, JDogné, JMPirotte, B Design, synthesis, and pharmacological evaluation of pyridinic analogues of nimesulide as cyclooxygenase-2 selective inhibitors. J Med Chem47:6749-59 (2004) 
 
Prostaglandin G/H synthase 2
Name:Prostaglandin G/H synthase 2
Type:Enzyme
Mol. Mass.:69003.89
Organism:Homo sapiens (Human)
Description:Recombinant Cox-2 provided by Cayman (Cayman Chemical Co.,Ann Arbor, MI).
Residue:604
BDBM50056999
NameBDBM50056999
Synonyms:CHEMBL56367 | nimesulide
TypeSmall organic molecule
Emp. Form.C13H12N2O5S
Mol. Mass.308.31
SMILESCS(=O)(=O)Nc1ccc(cc1Oc1ccccc1)[N+]([O-])=O