Reaction Details
TargetCytochrome P450 2C9
LigandBDBM50158458
Substrate/Competitorn/a
Meas. Tech.ChEMBL_430469 (CHEMBL916313)
Ki 40±n/a nM
Citation Locuson, CWSuzuki, HRettie, AEJones, JP Charge and substituent effects on affinity and metabolism of benzbromarone-based CYP2C19 inhibitors. J Med Chem47:6768-76 (2004) 
 
Cytochrome P450 2C9
Name:Cytochrome P450 2C9
Type:Enzyme
Mol. Mass.:55636.33
Organism:Homo sapiens (Human)
Description:P11712
Residue:490
BDBM50158458
NameBDBM50158458
Synonyms:(2-ethylbenzofuran-3-yl)(4-hydroxy-3,5-dimethylphenyl)methanone | CHEMBL225481
TypeSmall organic molecule
Emp. Form.C19H18O3
Mol. Mass.294.3444
SMILESCCc1oc2ccccc2c1C(=O)c1cc(C)c(O)c(C)c1