Reaction Details
TargetCytochrome P450 2C19
LigandBDBM50158469
Substrate/Competitorn/a
Meas. Tech.ChEMBL_430467 (CHEMBL916311)
Ki 2400±n/a nM
Citation Locuson, CWSuzuki, HRettie, AEJones, JP Charge and substituent effects on affinity and metabolism of benzbromarone-based CYP2C19 inhibitors. J Med Chem47:6768-76 (2004) 
 
Cytochrome P450 2C19
Name:Cytochrome P450 2C19
Type:Enzyme
Mol. Mass.:55935.47
Organism:Homo sapiens (Human)
Description:P33261
Residue:490
BDBM50158469
NameBDBM50158469
Synonyms:(3,5-dibromo-4-hydroxyphenyl)(2-methylbenzofuran-3-yl)methanone | CHEMBL224279
TypeSmall organic molecule
Emp. Form.C16H10Br2O3
Mol. Mass.410.057
SMILESCc1oc2ccccc2c1C(=O)c1cc(Br)c(O)c(Br)c1