Reaction Details
TargetMelanocortin receptor 5
LigandBDBM50158484
Substrate/Competitorn/a
Meas. Tech.ChEMBL_430488 (CHEMBL917737)
Ki 280±n/a nM
Citation Chen, CPontillo, JFleck, BAGao, YWen, JTran, JATucci, FCMarinkovic, DFoster, ACSaunders, J 4-{(2R)-[3-Aminopropionylamido]-3-(2,4-dichlorophenyl)propionyl}-1-{2-[(2-thienyl)ethylaminomethyl]phenyl}piperazine as a potent and selective melanocortin-4 receptor antagonist--design, synthesis, and characterization. J Med Chem47:6821-30 (2004) 
 
Melanocortin receptor 5
Name:Melanocortin receptor 5
Type:Enzyme
Mol. Mass.:36612.92
Organism:Homo sapiens (Human)
Description:P33032
Residue:325
BDBM50158484
NameBDBM50158484
Synonyms:(R)-3-amino-N-(3-(2,4-dichlorophenyl)-1-oxo-1-(4-(2-((2-(thiophen-2-yl)ethylamino)methyl)phenyl)piperazin-1-yl)propan-2-yl)propanamide 4-(2R)-[3-aminopropionylamido]-3-(2,4-dichlorophenyl)propionyl-1-2-[(thienyl)ethylaminomethyl]phenyl piperazine | CHEMBL365597
TypeSmall organic molecule
Emp. Form.C29H35Cl2N5O2S
Mol. Mass.588.592
SMILESNCCC(=O)N[C@H](Cc1ccc(Cl)cc1Cl)C(=O)N1CCN(CC1)c1ccccc1CNCCc1cccs1