Reaction Details
TargetReduced folate transporter
LigandBDBM50158571
Substrate/Competitorn/a
Meas. Tech.ChEMBL_430664 (CHEMBL919632)
Ki 1100±n/a nM
Citation Rosowsky, AForsch, RAWright, JE Synthesis and in vitro antifolate activity of rotationally restricted aminopterin and methotrexate analogues. J Med Chem47:6958-63 (2004) 
 
Reduced folate transporter
Name:Reduced folate transporter
Type:PROTEIN
Mol. Mass.:64885.16
Organism:Homo sapiens (Human)
Description:ChEMBL_1469594
Residue:591
BDBM50158571
NameBDBM50158571
Synonyms:2-S-[5-[N-(2,4--diaminopteridin-6-yl)methyl)-N-methyl-amino]-2,3-dihydro-1-oxo-2(1H)-isoindollyl]glutaric acid | CHEMBL224946
TypeSmall organic molecule
Emp. Form.C21H22N8O5
Mol. Mass.466.45
SMILESCN(Cc1cnc2nc(N)nc(N)c2n1)c1ccc2C(=O)N(Cc2c1)[C@@H](CCC(O)=O)C(O)=O