Reaction Details
TargetTransient receptor potential cation channel subfamily V member 1
LigandBDBM20464
Substrate/Competitorn/a
Meas. Tech.ChEMBL_312923 (CHEMBL874818)
IC50 0.420000±n/a nM
Citation Doherty, EMFotsch, CBo, YChakrabarti, PPChen, NGavva, NHan, NKelly, MGKincaid, JKlionsky, LLiu, QOgnyanov, VITamir, RWang, XZhu, JNorman, MHTreanor, JJ Discovery of potent, orally available vanilloid receptor-1 antagonists. Structure-activity relationship of N-aryl cinnamides. J Med Chem48:71-90 (2005) 
 
Transient receptor potential cation channel subfamily V member 1
Name:Transient receptor potential cation channel subfamily V member 1
Type:Protein
Mol. Mass.:94960.75
Organism:Homo sapiens (Human)
Description:Q8NER1
Residue:839
BDBM20464
NameBDBM20464
Synonyms:(2E)-3-[2-(piperidin-1-yl)-6-(trifluoromethyl)pyridin-3-yl]-N-(quinolin-7-yl)prop-2-enamide CHEMBL190874
TypeSmall organic molecule
Emp. Form.C23H21F3N4O
Mol. Mass.426.4342
SMILESFC(F)(F)c1ccc(\C=C\C(=O)Nc2ccc3cccnc3c2)c(n1)N1CCCCC1