Reaction Details
TargetReverse transcriptase/RNaseH
LigandBDBM50158717
Substrate/Competitorn/a
Meas. Tech.ChEMBL_306221 (CHEMBL831129)
IC50>100000±n/a nM
Citation Dayam, RSanchez, TClement, OShoemaker, RSei, SNeamati, N Beta-diketo acid pharmacophore hypothesis. 1. Discovery of a novel class of HIV-1 integrase inhibitors. J Med Chem48:111-20 (2005) 
 
Reverse transcriptase/RNaseH
Name:Reverse transcriptase/RNaseH
Type:PROTEIN
Mol. Mass.:65229.15
Organism:Human immunodeficiency virus 1
Description:ChEMBL_1473730
Residue:566
BDBM50158717
NameBDBM50158717
Synonyms:CHEMBL367031 | N-(2-Hydroxy-4-nitro-phenyl)-2-{4-oxo-2-thioxo-5-[1-p-tolyl-meth-(Z)-ylidene]-thiazolidin-3-yl}-acetamide
TypeSmall organic molecule
Emp. Form.C19H15N3O5S2
Mol. Mass.429.47
SMILESCc1ccc(\C=C2/SC(=S)N(CC(=O)Nc3ccc(cc3O)[N+]([O-])=O)C2=O)cc1