Reaction Details
TargetReverse transcriptase/RNaseH
LigandBDBM50158723
Substrate/Competitorn/a
Meas. Tech.ChEMBL_306221 (CHEMBL831129)
IC50 85000±n/a nM
Citation Dayam, RSanchez, TClement, OShoemaker, RSei, SNeamati, N Beta-diketo acid pharmacophore hypothesis. 1. Discovery of a novel class of HIV-1 integrase inhibitors. J Med Chem48:111-20 (2005) 
 
Reverse transcriptase/RNaseH
Name:Reverse transcriptase/RNaseH
Type:PROTEIN
Mol. Mass.:65229.15
Organism:Human immunodeficiency virus 1
Description:ChEMBL_1473730
Residue:566
BDBM50158723
NameBDBM50158723
Synonyms:4-(3-{4-Oxo-2-thioxo-5-[1-(3,4,5-trimethoxy-phenyl)-meth-(Z)-ylidene]-thiazolidin-3-yl}-propionylamino)-benzoic acid cid_5348272
TypeSmall organic molecule
Emp. Form.C23H22N2O7S2
Mol. Mass.502.56
SMILESCOc1cc(\C=C2\SC(=S)N(CCC(=O)Nc3ccc(cc3)C(O)=O)C2=O)cc(OC)c1OC