Reaction Details
TargetReverse transcriptase/RNaseH
LigandBDBM50158743
Substrate/Competitorn/a
Meas. Tech.ChEMBL_306176 (CHEMBL830970)
IC50>100000±n/a nM
Citation Dayam, RSanchez, TClement, OShoemaker, RSei, SNeamati, N Beta-diketo acid pharmacophore hypothesis. 1. Discovery of a novel class of HIV-1 integrase inhibitors. J Med Chem48:111-20 (2005) 
 
Reverse transcriptase/RNaseH
Name:Reverse transcriptase/RNaseH
Type:PROTEIN
Mol. Mass.:65229.15
Organism:Human immunodeficiency virus 1
Description:ChEMBL_1473730
Residue:566
BDBM50158743
NameBDBM50158743
Synonyms:2-Hydroxy-5-[(5-methyl-furan-2-carbonyl)-amino]-benzoic acid | CHEMBL179024
TypeSmall organic molecule
Emp. Form.C13H11NO5
Mol. Mass.261.2301
SMILESCc1ccc(o1)C(=O)Nc1ccc(O)c(c1)C(O)=O