Reaction Details
TargetReverse transcriptase/RNaseH
LigandBDBM15188
Substrate/Competitorn/a
Meas. Tech.ChEMBL_306176 (CHEMBL830970)
IC50 40000±n/a nM
Citation Dayam, RSanchez, TClement, OShoemaker, RSei, SNeamati, N Beta-diketo acid pharmacophore hypothesis. 1. Discovery of a novel class of HIV-1 integrase inhibitors. J Med Chem48:111-20 (2005) 
 
Reverse transcriptase/RNaseH
Name:Reverse transcriptase/RNaseH
Type:PROTEIN
Mol. Mass.:65229.15
Organism:Human immunodeficiency virus 1
Description:ChEMBL_1473730
Residue:566
BDBM15188
NameBDBM15188
Synonyms:5-{5-[(1,3-dioxo-2,3-dihydro-1H-inden-2-ylidene)methyl]furan-2-yl}-2-hydroxybenzoic acid compound 3 | compound 5378650
TypeSmall organic molecule
Emp. Form.C21H12O6
Mol. Mass.360.3164
SMILES[#8]-[#6](=O)-c1cc(ccc1-[#8])-c1ccc(\[#6]=[#6]-2/[#6](=O)-c3ccccc3-[#6]-2=O)o1