Reaction Details
TargetReverse transcriptase/RNaseH
LigandBDBM50158733
Substrate/Competitorn/a
Meas. Tech.ChEMBL_306221 (CHEMBL831129)
IC50 100000±n/a nM
Citation Dayam, RSanchez, TClement, OShoemaker, RSei, SNeamati, N Beta-diketo acid pharmacophore hypothesis. 1. Discovery of a novel class of HIV-1 integrase inhibitors. J Med Chem48:111-20 (2005) 
 
Reverse transcriptase/RNaseH
Name:Reverse transcriptase/RNaseH
Type:PROTEIN
Mol. Mass.:65229.15
Organism:Human immunodeficiency virus 1
Description:ChEMBL_1473730
Residue:566
BDBM50158733
NameBDBM50158733
Synonyms:3-[3-Furan-2-ylmethyl-4-oxo-2-thioxo-thiazolidin-(5E)-ylidenemethyl]-2-(2-hydroxy-ethylamino)-pyrido[1,2-a]pyrimidin-4-one | CHEMBL176084
TypeSmall organic molecule
Emp. Form.C19H16N4O4S2
Mol. Mass.428.485
SMILESOCCNc1nc2ccccn2c(=O)c1\C=C1/SC(=S)N(Cc2ccco2)C1=O