Reaction Details
TargetReverse transcriptase/RNaseH
LigandBDBM50158735
Substrate/Competitorn/a
Meas. Tech.ChEMBL_306176 (CHEMBL830970)
IC50 93000±n/a nM
Citation Dayam, RSanchez, TClement, OShoemaker, RSei, SNeamati, N Beta-diketo acid pharmacophore hypothesis. 1. Discovery of a novel class of HIV-1 integrase inhibitors. J Med Chem48:111-20 (2005) 
 
Reverse transcriptase/RNaseH
Name:Reverse transcriptase/RNaseH
Type:PROTEIN
Mol. Mass.:65229.15
Organism:Human immunodeficiency virus 1
Description:ChEMBL_1473730
Residue:566
BDBM50158735
NameBDBM50158735
Synonyms:3-(3-{5-[1-(4-Ethoxy-phenyl)-meth-(Z)-ylidene]-4-oxo-2-thioxo-thiazolidin-3-yl}-propionylamino)-benzoic acid cid_1580464
TypeSmall organic molecule
Emp. Form.C22H20N2O5S2
Mol. Mass.456.535
SMILESCCOc1ccc(\C=C2/SC(=S)N(CCC(=O)Nc3cccc(c3)C(O)=O)C2=O)cc1