Reaction Details
TargetReverse transcriptase/RNaseH
LigandBDBM50158741
Substrate/Competitorn/a
Meas. Tech.ChEMBL_306176 (CHEMBL830970)
IC50 61000±n/a nM
Citation Dayam, RSanchez, TClement, OShoemaker, RSei, SNeamati, N Beta-diketo acid pharmacophore hypothesis. 1. Discovery of a novel class of HIV-1 integrase inhibitors. J Med Chem48:111-20 (2005) 
 
Reverse transcriptase/RNaseH
Name:Reverse transcriptase/RNaseH
Type:PROTEIN
Mol. Mass.:65229.15
Organism:Human immunodeficiency virus 1
Description:ChEMBL_1473730
Residue:566
BDBM50158741
NameBDBM50158741
Synonyms:4-(3-{5-[1-(3,4-Dimethoxy-phenyl)-meth-(Z)-ylidene]-4-oxo-2-thioxo-thiazolidin-3-yl}-propionylamino)-2-hydroxy-benzoic acid | CHEMBL176150
TypeSmall organic molecule
Emp. Form.C22H20N2O7S2
Mol. Mass.488.533
SMILESCOc1ccc(\C=C2\SC(=S)N(CCC(=O)Nc3ccc(C(O)=O)c(O)c3)C2=O)cc1OC