Reaction Details
TargetReverse transcriptase/RNaseH
LigandBDBM50158706
Substrate/Competitorn/a
Meas. Tech.ChEMBL_306176 (CHEMBL830970)
IC50 15000±n/a nM
Citation Dayam, RSanchez, TClement, OShoemaker, RSei, SNeamati, N Beta-diketo acid pharmacophore hypothesis. 1. Discovery of a novel class of HIV-1 integrase inhibitors. J Med Chem48:111-20 (2005) 
 
Reverse transcriptase/RNaseH
Name:Reverse transcriptase/RNaseH
Type:PROTEIN
Mol. Mass.:65229.15
Organism:Human immunodeficiency virus 1
Description:ChEMBL_1473730
Residue:566
BDBM50158706
NameBDBM50158706
Synonyms:5-(3-{5-[1-(4-Ethyl-phenyl)-meth-(Z)-ylidene]-4-oxo-2-thioxo-thiazolidin-3-yl}-propionylamino)-2-hydroxy-benzoic acid | CHEMBL176113
TypeSmall organic molecule
Emp. Form.C22H20N2O5S2
Mol. Mass.456.535
SMILESCCc1ccc(\C=C2/SC(=S)N(CCC(=O)Nc3ccc(O)c(c3)C(O)=O)C2=O)cc1