Reaction Details
TargetReverse transcriptase/RNaseH
LigandBDBM50158709
Substrate/Competitorn/a
Meas. Tech.ChEMBL_306221 (CHEMBL831129)
IC50>100000±n/a nM
Citation Dayam, RSanchez, TClement, OShoemaker, RSei, SNeamati, N Beta-diketo acid pharmacophore hypothesis. 1. Discovery of a novel class of HIV-1 integrase inhibitors. J Med Chem48:111-20 (2005) 
 
Reverse transcriptase/RNaseH
Name:Reverse transcriptase/RNaseH
Type:PROTEIN
Mol. Mass.:65229.15
Organism:Human immunodeficiency virus 1
Description:ChEMBL_1473730
Residue:566
BDBM50158709
NameBDBM50158709
Synonyms:2-Hydroxy-5-(3,4,5-trimethoxy-benzoylamino)-benzoic acid | CHEMBL177242
TypeSmall organic molecule
Emp. Form.C17H17NO7
Mol. Mass.347.3194
SMILESCOc1cc(cc(OC)c1OC)C(=O)Nc1ccc(O)c(c1)C(O)=O