Reaction Details
TargetReverse transcriptase/RNaseH
LigandBDBM23398
Substrate/Competitorn/a
Meas. Tech.ChEMBL_306286 (CHEMBL828428)
IC50 20±n/a nM
Citation Dayam, RSanchez, TClement, OShoemaker, RSei, SNeamati, N Beta-diketo acid pharmacophore hypothesis. 1. Discovery of a novel class of HIV-1 integrase inhibitors. J Med Chem48:111-20 (2005) 
 
Reverse transcriptase/RNaseH
Name:Reverse transcriptase/RNaseH
Type:PROTEIN
Mol. Mass.:65229.15
Organism:Human immunodeficiency virus 1
Description:ChEMBL_1473730
Residue:566
BDBM23398
NameBDBM23398
Synonyms:(2Z)-1-{5-[(4-fluorophenyl)methyl]furan-2-yl}-3-hydroxy-3-(1H-1,2,4-triazol-3-yl)prop-2-en-1-one S-1360
TypeSmall organic molecule
Emp. Form.C16H12FN3O3
Mol. Mass.313.2832
SMILESFc1ccc(Cc2ccc(o2)C(=O)CC(=O)c2nnc[nH]2)cc1