Reaction Details
TargetPhenylethanolamine N-methyltransferase
LigandBDBM13014
Substrate/Competitorn/a
Meas. Tech.ChEMBL_303174 (CHEMBL829668)
Ki 3.1±n/a nM
Citation Grunewald, GLRomero, FACriscione, KR 3-hydroxymethyl-7-(N-substituted aminosulfonyl)-1,2,3,4-tetrahydroisoquinoline inhibitors of phenylethanolamine N-methyltransferase that display remarkable potency and selectivity. J Med Chem48:134-40 (2005) 
 
Phenylethanolamine N-methyltransferase
Name:Phenylethanolamine N-methyltransferase
Type:Enzyme
Mol. Mass.:30852.66
Organism:Homo sapiens (Human)
Description:n/a
Residue:282
BDBM13014
NameBDBM13014
Synonyms:7,8-Dichloro-1,2,3,4-tetrahydro-isoquinoline; hydrochloride CHEMBL287837 SKF 64139 | tetrahydroisoquinoline (THIQ) analogue
TypeSmall organic molecule
Emp. Form.C9H9Cl2N
Mol. Mass.202.08
SMILESClc1ccc2CCNCc2c1Cl