Reaction Details
TargetAdenosine receptor A3
LigandBDBM50094694
Substrate/Competitorn/a
Meas. Tech.ChEMBL_302754 (CHEMBL838701)
Ki 0.14±n/a nM
Citation Moro, SBraiuca, PDeflorian, FFerrari, CPastorin, GCacciari, BBaraldi, PGVarani, KBorea, PASpalluto, G Combined target-based and ligand-based drug design approach as a tool to define a novel 3D-pharmacophore model of human A3 adenosine receptor antagonists: pyrazolo[4,3-e]1,2,4-triazolo[1,5-c]pyrimidine derivatives as a key study. J Med Chem48:152-62 (2005) 
 
Adenosine receptor A3
Name:Adenosine receptor A3
Type:G Protein-Coupled Receptor (GPCR)
Mol. Mass.:36197.32
Organism:Homo sapiens (Human)
Description:P0DMS8
Residue:318
BDBM50094694
NameBDBM50094694
Synonyms:1-(9-Chloro-2-furan-2-yl-[1,2,4]triazolo[1,5-c]quinazolin-5-yl)-3-(4-methoxy-phenyl)-urea | CHEMBL144979
TypeSmall organic molecule
Emp. Form.C21H15ClN6O3
Mol. Mass.434.835
SMILESCOc1ccc(NC(=O)Nc2nc3ccc(Cl)cc3c3nc(nn23)-c2ccco2)cc1