Reaction Details
TargetAdenosine receptor A3
LigandBDBM50109456
Substrate/Competitorn/a
Meas. Tech.ChEMBL_302754 (CHEMBL838701)
Ki 0.21±n/a nM
Citation Moro, SBraiuca, PDeflorian, FFerrari, CPastorin, GCacciari, BBaraldi, PGVarani, KBorea, PASpalluto, G Combined target-based and ligand-based drug design approach as a tool to define a novel 3D-pharmacophore model of human A3 adenosine receptor antagonists: pyrazolo[4,3-e]1,2,4-triazolo[1,5-c]pyrimidine derivatives as a key study. J Med Chem48:152-62 (2005) 
 
Adenosine receptor A3
Name:Adenosine receptor A3
Type:G Protein-Coupled Receptor (GPCR)
Mol. Mass.:36197.32
Organism:Homo sapiens (Human)
Description:P0DMS8
Residue:318
BDBM50109456
NameBDBM50109456
Synonyms:1-(8-Butyl-2-furan-2-yl-8H-pyrazolo[4,3-e][1,2,4]triazolo[1,5-c]pyrimidin-5-yl)-3-phenyl-urea CHEMBL349240 | MRE 3062F20
TypeSmall organic molecule
Emp. Form.C21H20N8O2
Mol. Mass.416.4359
SMILESCCCCn1cc2c(n1)nc(NC(=O)Nc1ccccc1)n1nc(nc21)-c1ccco1