Reaction Details
TargetTranslocator protein
LigandBDBM50159099
Substrate/Competitorn/a
Meas. Tech.ChEMBL_303755 (CHEMBL829798)
Ki 98.766±n/a nM
Citation Trapani, GLaquintana, VDenora, NTrapani, ALopedota, ALatrofa, AFranco, MSerra, MPisu, MGFloris, ISanna, EBiggio, GLiso, G Structure-activity relationships and effects on neuroactive steroid synthesis in a series of 2-phenylimidazo[1,2-a]pyridineacetamide peripheral benzodiazepine receptors ligands. J Med Chem48:292-305 (2005) 
 
Translocator protein
Name:Translocator protein
Type:Mitochondrion membrane protein
Mol. Mass.:18945.84
Organism:Rattus norvegicus (rat)
Description:Competitive binding experiments were performed on rat kidney mitochondrial membranes.
Residue:169
BDBM50159099
NameBDBM50159099
Synonyms:CHEMBL362200 | N-Benzyl-2-[6,8-dichloro-2-(4-chloro-phenyl)-imidazo[1,2-a]pyridin-3-yl]-acetamide
TypeSmall organic molecule
Emp. Form.C22H16Cl3N3O
Mol. Mass.444.741
SMILESClc1ccc(cc1)-c1nc2c(Cl)cc(Cl)cn2c1CC(=O)NCc1ccccc1