Reaction Details
TargetTranslocator protein
LigandBDBM50159079
Substrate/Competitorn/a
Meas. Tech.ChEMBL_303739 (CHEMBL829782)
Ki 50.528±n/a nM
Citation Trapani, GLaquintana, VDenora, NTrapani, ALopedota, ALatrofa, AFranco, MSerra, MPisu, MGFloris, ISanna, EBiggio, GLiso, G Structure-activity relationships and effects on neuroactive steroid synthesis in a series of 2-phenylimidazo[1,2-a]pyridineacetamide peripheral benzodiazepine receptors ligands. J Med Chem48:292-305 (2005) 
 
Translocator protein
Name:Translocator protein
Type:Mitochondrion membrane protein
Mol. Mass.:18945.84
Organism:Rattus norvegicus (rat)
Description:Competitive binding experiments were performed on rat kidney mitochondrial membranes.
Residue:169
BDBM50159079
NameBDBM50159079
Synonyms:2-[6,8-Dichloro-2-(4-chloro-phenyl)-imidazo[1,2-a]pyridin-3-yl]-N-(4-nitro-benzyl)-N-propyl-acetamide | CHEMBL179748
TypeSmall organic molecule
Emp. Form.C25H21Cl3N4O3
Mol. Mass.531.818
SMILESCCCN(Cc1ccc(cc1)[N+]([O-])=O)C(=O)Cc1c(nc2c(Cl)cc(Cl)cn12)-c1ccc(Cl)cc1