Reaction Details
TargetTranslocator protein
LigandBDBM50159083
Substrate/Competitorn/a
Meas. Tech.ChEMBL_303755 (CHEMBL829798)
Ki 23.64±n/a nM
Citation Trapani, GLaquintana, VDenora, NTrapani, ALopedota, ALatrofa, AFranco, MSerra, MPisu, MGFloris, ISanna, EBiggio, GLiso, G Structure-activity relationships and effects on neuroactive steroid synthesis in a series of 2-phenylimidazo[1,2-a]pyridineacetamide peripheral benzodiazepine receptors ligands. J Med Chem48:292-305 (2005) 
 
Translocator protein
Name:Translocator protein
Type:Mitochondrion membrane protein
Mol. Mass.:18945.84
Organism:Rattus norvegicus (rat)
Description:Competitive binding experiments were performed on rat kidney mitochondrial membranes.
Residue:169
BDBM50159083
NameBDBM50159083
Synonyms:2-(6,8-Dichloro-2-phenyl-imidazo[1,2-a]pyridin-3-yl)-1-(3,4-dihydro-1H-isoquinolin-2-yl)-ethanone CHEMBL369327
TypeSmall organic molecule
Emp. Form.C24H19Cl2N3O
Mol. Mass.436.333
SMILESClc1cc(Cl)c2nc(c(CC(=O)N3CCc4ccccc4C3)n2c1)-c1ccccc1