Reaction Details
TargetTranslocator protein
LigandBDBM50159103
Substrate/Competitorn/a
Meas. Tech.ChEMBL_303739 (CHEMBL829782)
Ki 1033.925±n/a nM
Citation Trapani, GLaquintana, VDenora, NTrapani, ALopedota, ALatrofa, AFranco, MSerra, MPisu, MGFloris, ISanna, EBiggio, GLiso, G Structure-activity relationships and effects on neuroactive steroid synthesis in a series of 2-phenylimidazo[1,2-a]pyridineacetamide peripheral benzodiazepine receptors ligands. J Med Chem48:292-305 (2005) 
 
Translocator protein
Name:Translocator protein
Type:Mitochondrion membrane protein
Mol. Mass.:18945.84
Organism:Rattus norvegicus (rat)
Description:Competitive binding experiments were performed on rat kidney mitochondrial membranes.
Residue:169
BDBM50159103
NameBDBM50159103
Synonyms:2-(6,8-Dichloro-2-phenyl-imidazo[1,2-a]pyridin-3-yl)-1-piperidin-1-yl-ethanone | CHEMBL363217
TypeSmall organic molecule
Emp. Form.C20H19Cl2N3O
Mol. Mass.388.29
SMILESClc1cc(Cl)c2nc(c(CC(=O)N3CCCCC3)n2c1)-c1ccccc1