Reaction Details
TargetHistamine H3 receptor
LigandBDBM50159110
Substrate/Competitorn/a
Meas. Tech.ChEMBL_303027 (CHEMBL830414)
Ki 0.2±n/a nM
Citation Zaragoza, FStephensen, HPeschke, BRimvall, K 2-(4-alkylpiperazin-1-yl)quinolines as a new class of imidazole-free histamine H3 receptor antagonists. J Med Chem48:306-11 (2005) 
 
Histamine H3 receptor
Name:Histamine H3 receptor
Type:G Protein-Coupled Receptor (GPCR)
Mol. Mass.:48691.47
Organism:Homo sapiens (Human)
Description:Binding assays were using CHO cells stably expressing hH3R receptors.
Residue:445
BDBM50159110
NameBDBM50159110
Synonyms:1-(3-(4-(piperidin-1-ylmethyl)phenoxy)propyl)piperidine 1-[3-(4-hexahydro-1-pyridinylmethylphenoxy)propyl]hexahydropyridine CHEMBL129542 | JNJ-5207852
TypeSmall organic molecule
Emp. Form.C20H32N2O
Mol. Mass.316.4809
SMILESC(COc1ccc(CN2CCCCC2)cc1)CN1CCCCC1