Reaction Details
TargetHistamine H3 receptor
LigandBDBM50159117
Substrate/Competitorn/a
Meas. Tech.ChEMBL_303027 (CHEMBL830414)
Ki 28±n/a nM
Citation Zaragoza, FStephensen, HPeschke, BRimvall, K 2-(4-alkylpiperazin-1-yl)quinolines as a new class of imidazole-free histamine H3 receptor antagonists. J Med Chem48:306-11 (2005) 
 
Histamine H3 receptor
Name:Histamine H3 receptor
Type:G Protein-Coupled Receptor (GPCR)
Mol. Mass.:48691.47
Organism:Homo sapiens (Human)
Description:Binding assays were using CHO cells stably expressing hH3R receptors.
Residue:445
BDBM50159117
NameBDBM50159117
Synonyms:2-(4-Cyclopentyl-piperazin-1-yl)-quinoline | CHEMBL178608
TypeSmall organic molecule
Emp. Form.C18H23N3
Mol. Mass.281.3953
SMILESC1CCC(C1)N1CCN(CC1)c1ccc2ccccc2n1