Reaction Details
TargetHistamine H3 receptor
LigandBDBM50159124
Substrate/Competitorn/a
Meas. Tech.ChEMBL_303027 (CHEMBL830414)
Ki 300±n/a nM
Citation Zaragoza, FStephensen, HPeschke, BRimvall, K 2-(4-alkylpiperazin-1-yl)quinolines as a new class of imidazole-free histamine H3 receptor antagonists. J Med Chem48:306-11 (2005) 
 
Histamine H3 receptor
Name:Histamine H3 receptor
Type:G Protein-Coupled Receptor (GPCR)
Mol. Mass.:48691.47
Organism:Homo sapiens (Human)
Description:Binding assays were using CHO cells stably expressing hH3R receptors.
Residue:445
BDBM50159124
NameBDBM50159124
Synonyms:5,7-Dichloro-2-(4-cyclopropyl-piperazin-1-yl)-quinoline | CHEMBL179623
TypeSmall organic molecule
Emp. Form.C16H17Cl2N3
Mol. Mass.322.232
SMILESClc1cc(Cl)c2ccc(nc2c1)N1CCN(CC1)C1CC1