Reaction Details
TargetHistamine H3 receptor
LigandBDBM50159121
Substrate/Competitorn/a
Meas. Tech.ChEMBL_303027 (CHEMBL830414)
Ki 4.8±n/a nM
Citation Zaragoza, FStephensen, HPeschke, BRimvall, K 2-(4-alkylpiperazin-1-yl)quinolines as a new class of imidazole-free histamine H3 receptor antagonists. J Med Chem48:306-11 (2005) 
 
Histamine H3 receptor
Name:Histamine H3 receptor
Type:G Protein-Coupled Receptor (GPCR)
Mol. Mass.:48691.47
Organism:Homo sapiens (Human)
Description:Binding assays were using CHO cells stably expressing hH3R receptors.
Residue:445
BDBM50159121
NameBDBM50159121
Synonyms:2-(4-Cyclopropyl-piperazin-1-yl)-quinoline-6-carbonitrile | CHEMBL179672
TypeSmall organic molecule
Emp. Form.C17H18N4
Mol. Mass.278.3516
SMILESN#Cc1ccc2nc(ccc2c1)N1CCN(CC1)C1CC1