Reaction Details
TargetKappa-type opioid receptor
LigandBDBM50159161
Substrate/Competitorn/a
Meas. Tech.ChEMBL_303490 (CHEMBL838864)
Ki 6±n/a nM
Citation Munro, TARizzacasa, MARoth, BLToth, BAYan, F Studies toward the pharmacophore of salvinorin A, a potent kappa opioid receptor agonist. J Med Chem48:345-8 (2005) 
 
Kappa-type opioid receptor
Name:Kappa-type opioid receptor
Type:G Protein-Coupled Receptor (GPCR)
Mol. Mass.:42692.90
Organism:Rattus norvegicus (rat)
Description:P34975
Residue:380
BDBM50159161
NameBDBM50159161
Synonyms:(3S,4aS,4bR,6S,8R,8aR,10aR)-6-Acetoxy-3-furan-3-yl-4a,8a-dimethyl-5-oxo-dodecahydro-2-oxa-phenanthrene-8-carboxylic acid methyl ester | CHEMBL370678
TypeSmall organic molecule
Emp. Form.C23H30O7
Mol. Mass.418.4801
SMILESCOC(=O)[C@@H]1C[C@H](OC(C)=O)C(=O)[C@H]2[C@@]1(C)CC[C@H]1CO[C@@H](C[C@]21C)c1ccoc1