Reaction Details
TargetKappa-type opioid receptor
LigandBDBM50159162
Substrate/Competitorn/a
Meas. Tech.ChEMBL_303490 (CHEMBL838864)
Ki 6±n/a nM
Citation Munro, TARizzacasa, MARoth, BLToth, BAYan, F Studies toward the pharmacophore of salvinorin A, a potent kappa opioid receptor agonist. J Med Chem48:345-8 (2005) 
 
Kappa-type opioid receptor
Name:Kappa-type opioid receptor
Type:G Protein-Coupled Receptor (GPCR)
Mol. Mass.:42692.90
Organism:Rattus norvegicus (rat)
Description:P34975
Residue:380
BDBM50159162
NameBDBM50159162
Synonyms:(3S,4aR,4bS,6S,8R,8aR)-6-Acetoxy-3-furan-3-yl-4a,8a-dimethyl-5-oxo-4,4a,4b,5,6,7,8,8a,9,10-decahydro-3H-2-oxa-phenanthrene-8-carboxylic acid methyl ester | CHEMBL194545
TypeSmall organic molecule
Emp. Form.C23H28O7
Mol. Mass.416.4642
SMILESCOC(=O)[C@@H]1C[C@H](OC(C)=O)C(=O)[C@H]2[C@@]1(C)CCC1=CO[C@@H](C[C@]21C)c1ccoc1