Reaction Details
TargetTubulin beta-1 chain
LigandBDBM50005480
Substrate/Competitorn/a
Meas. Tech.ChEMBL_305199 (CHEMBL832453)
IC50 180±n/a nM
Citation Ducki, SMackenzie, GLawrence, NJSnyder, JP Quantitative structure-activity relationship (5D-QSAR) study of combretastatin-like analogues as inhibitors of tubulin assembly. J Med Chem48:457-65 (2005) 
 
Tubulin beta-1 chain
Name:Tubulin beta-1 chain
Type:PROTEIN
Mol. Mass.:50311.77
Organism:Homo sapiens (Human)
Description:ChEMBL_305173
Residue:451
BDBM50005480
NameBDBM50005480
Synonyms:(-)-combretastatin (Z)-5-(3,4,5-trimethoxystyryl)-2-methoxyphenol (combretastin A-4)2-Methoxy-5-[2-(3,4,5-trimethoxy-phenyl)-vinyl]-phenol 2-Methoxy-5-[(Z)-2-(3,4,5-trimethoxy-phenyl)-vinyl]-phenol 2-methoxy-5-(3,4,5-trimethoxystyryl)phenol 5-(3,4,5-trimethoxystyryl)-2-methoxyphenol CHEMBL67 Combrestatin A4 Combretastatin Combretastin A-4 combretastatin A-4, (CSA4) | combretastin A4
TypeSmall organic molecule
Emp. Form.C18H20O5
Mol. Mass.316.3484
SMILESCOc1ccc(\C=C/c2cc(OC)c(OC)c(OC)c2)cc1O