Reaction Details
TargetSomatostatin receptor type 4
LigandBDBM50159422
Substrate/Competitorn/a
Meas. Tech.ChEMBL_306615 (CHEMBL829075)
IC50 1.7±n/a nM
Citation Erchegyi, JHoeger, CALow, WHoyer, DWaser, BEltschinger, VSchaer, JCCescato, RReubi, JCRivier, JE Somatostatin receptor 1 selective analogues: 2. N(alpha)-Methylated scan. J Med Chem48:507-14 (2005) 
 
Somatostatin receptor type 4
Name:Somatostatin receptor type 4
Type:Enzyme
Mol. Mass.:42015.38
Organism:Homo sapiens (Human)
Description:P31391
Residue:388
BDBM50159422
NameBDBM50159422
Synonyms:CHEMBL408338 | Des-AA5-[D-Trp8]SRIF
TypeSmall organic molecule
Emp. Form.C72H98N16O17S2
Mol. Mass.1523.776
SMILESC[C@@H](O)[C@H]1NC(=O)[C@H](Cc2ccccc2)NC(=O)[C@H](NC(=O)[C@H](CCCCN)NC(=O)[C@H](Cc2c[nH]c3ccccc23)NC(=O)[C@H](Cc2ccccc2)NC(=O)[C@@H](Cc2ccccc2)NC(=O)[C@@H](CCCCN)NC(=O)[C@@H](CSSC[C@H](NC(=O)[C@H](CO)NC1=O)C(O)=O)NC(=O)CNC(=O)[C@H](C)N)[C@@H](C)O