Reaction Details
TargetSerine/threonine-protein kinase mTOR
LigandBDBM12915
Substrate/Competitorn/a
Meas. Tech.ChEMBL_305425 (CHEMBL830918)
IC50 2500±n/a nM
Citation Griffin, RJFontana, GGolding, BTGuiard, SHardcastle, IRLeahy, JJMartin, NRichardson, CRigoreau, LStockley, MSmith, GC Selective benzopyranone and pyrimido[2,1-a]isoquinolin-4-one inhibitors of DNA-dependent protein kinase: synthesis, structure-activity studies, and radiosensitization of a human tumor cell line in vitro. J Med Chem48:569-85 (2005) 
 
Serine/threonine-protein kinase mTOR
Name:Serine/threonine-protein kinase mTOR
Type:Rapamycin target protein
Mol. Mass.:288917.12
Organism:Homo sapiens (Human)
Description:P42345
Residue:2549
BDBM12915
NameBDBM12915
Synonyms:2-(4-Morpholinyl)-8-phenyl-4H-1-benzopyran-4-one CHEMBL98350 US10308662, Compound LY294002 | US9505780, LY294002
TypeSmall organic molecule
Emp. Form.C19H17NO3
Mol. Mass.307.3432
SMILESO=c1cc(oc2c(cccc12)-c1ccccc1)N1CCOCC1