Reaction Details
TargetDelta-type opioid receptor
LigandBDBM50159681
Substrate/Competitorn/a
Meas. Tech.ChEMBL_302899 (CHEMBL830360)
Ki 55.7±n/a nM
Citation Li, TFujita, YTsuda, YMiyazaki, AAmbo, ASasaki, YJinsmaa, YBryant, SDLazarus, LHOkada, Y Development of potent mu-opioid receptor ligands using unique tyrosine analogues of endomorphin-2. J Med Chem48:586-92 (2005) 
 
Delta-type opioid receptor
Name:Delta-type opioid receptor
Type:G Protein-Coupled Receptor (GPCR)
Mol. Mass.:40465.04
Organism:Rattus norvegicus (rat)
Description:Competition binding assays were using CHO-K1 cell membranes expressing the opioid receptor.
Residue:372
BDBM50159681
NameBDBM50159681
Synonyms:(S)-1-[2-Amino-3-(2-ethyl-4-hydroxy-6-methyl-phenyl)-propionyl]-pyrrolidine-2-carboxylic acid [(S)-1-((S)-1-carbamoyl-2-phenyl-ethylcarbamoyl)-2-phenyl-ethyl]-amide | CHEMBL175770
TypeSmall organic molecule
Emp. Form.C35H43N5O5
Mol. Mass.613.7464
SMILESCCc1cc(O)cc(C)c1CC(N)C(=O)N1CCC[C@H]1C(=O)N[C@@H](Cc1ccccc1)C(=O)N[C@@H](Cc1ccccc1)C(N)=O